{"text_format":"1","workbook":"xlsx","n_sheets":4,"sheets":["Applicant Rating Form","Factors","Zip Codes","Sheet1"],"not_rendered":{"charts":0,"images":29,"macros":1,"external_links":2,"defined_names":7,"comments":0,"pivot_tables":0},"unopened":[],"bounds":{"document_bytes":16777216,"sheet_cells":100000,"rows_first":2000,"rows_last":500,"rows_between":2000,"halvings":0,"cell_chars":16384,"cell_head_chars":4096},"cells_cut":0,"cells_raw":0,"read":"whole","date_system":"1900"}

{"sheet":"Applicant Rating Form","index":0,"n_rows":118,"n_cols":45,"rows_kept":118,"cut":false,"hidden":false,"merged":[[4,46,6,49],[4,11,4,33],[7,46,9,49],[9,2,9,32],[19,32,20,32],[13,2,13,32],[10,1,10,33],[11,2,11,32],[19,31,20,31],[2,16,2,31],[27,19,27,23],[98,2,98,32],[58,31,62,31],[83,31,86,31],[83,32,86,32],[58,32,62,32],[70,31,73,31],[70,32,73,32],[76,31,81,31],[76,32,81,32],[18,2,20,11],[51,4,51,29],[43,4,43,29],[22,4,22,29],[50,24,50,29],[52,41,56,41],[67,31,68,31],[67,32,68,32],[43,35,43,36],[22,32,34,32],[42,32,47,32],[42,31,47,31],[22,31,34,31]]}
[]
[]
[null,"Enter Development Name:"]
[]
[]
[null,null,null,null,null,null,null,"MISSISSIPPI HOME CORPORATION"]
[null,null,null,null,null,null,null,"Housing Tax Credit Program"]
[]
[]
[]
[null," APPLICANT RATING FORM"]
[null,null,{"$f":"IF(Q3=\"\",\"\",Q3)","v":""}]
[]
[null,null,"Applicants must meet the MINIMUM THRESHOLD REQUIREMENTS (as identified in Section 4 of the QAP) using the selection criteria below in order to receive further consideration for tax credits.  Applicants must adhere to the guidelines outlined in the Selection Criteria (Addendum A).  Points will not be awarded if sufficient supporting documentation is not provided with the application.  "]
[]
[null,null,null,null,null,null,null,null,null,null,null,null,null,null,null,null,null,null,null,null,null,null,null,null,null,null,null,null,null,null,null,null,{"$f":"IF(O3=\"\",\"\",O3)","v":""}]
[null,null,null,null,null,null,null,null,null,null,null,null,null,null,null,null,null,null,null,null,null,null,null,null,null,null,null,null,null,null,null,"SELF SCORE:",{"$f":"AG97","v":0}]
[]
[null,null,"SELECTION CRITERIA"]
[null,null,null,null,null,null,null,null,null,null,null,null,null,null,null,null,null,null,null,null,null,null,null,null,null,null,null,null,null,null,null,"Max Points","Self-Score"]
[]
[null,null,"SITE LOCATION",null,null,null,null,null,null,null,null,null,null,null,null,null,null,null,null,null,null,null,null,null,null,null,null,null,null,null,null,10,{"$f":"MIN(10,SUM(AG23:AG35))","v":0}]
[null,null,null,null,null,null,null,null,null,null,null,null,null,null,null,null,null,null,null,null,null,null,null,null,null,null,null,null,null,null,null,10,{"$f":"IF(AM35>10,10,AM35)","v":0}]
[null,null,"1.",null,"CONTRIBUTES to a CONCERTED REVITALIZATION PLAN ",null,null,null,null,null,null,null,null,null,null,null,null,null,null,null,null,null,null,null,null,null,null,null,null,null,null,null,null,null,null,{"$f":"IF(E25=TRUE,5,0)","v":0}]
[null,null,null,null,false,null,"The development contributes to a Concerted Revitalization Plan.  (5 pts.)"]
[]
[null,null,"2.",null,"QUALIFIED ZIP CODES",null,null,null,null,null,null,null,null,null,null,null,null,null,null,null,null,null,null,null,{"$f":"IF(Y28=\"Error\",\"Contact MHC\",\"\")","v":""},null,null,null,null,null,null,null,null,null,null,{"$f":"IF(E28=TRUE,(IF(Y28=\"Yes\",5,0)),0)","v":0}]
[null,null,null,null,false,null,"Select zip code for the development:",null,null,null,null,null,null,null,null,400,null,null,null,"Qualified Zip Code?",null,null,null,null,{"$f":"VLOOKUP(P28,'Zip Codes'!A6:F513,5)","v":"Yes"},null,"(5 pts)"]
[]
[null,null,"3.",null,"HIGH OPPORTUNITY AREA",null,null,null,null,null,null,null,null,null,null,null,null,null,null,null,null,null,null,null,null,null,null,null,null,null,null,null,null,null,null,{"$f":"IF(E31=TRUE,10,0)","v":0}]
[null,null,null,null,false,null,"Development is located within a high opportunity tract.   (10 pts.)"]
[]
[null,null,4,null,"BUSINESS DEVELOPMENT AREA",null,null,null,null,null,null,null,null,null,null,null,null,null,null,null,null,null,null,null,null,null,null,null,null,null,null,null,null,null,null,{"$f":"IF(E34=TRUE,10,0)","v":0}]
[null,null,null,null,false,null,"Development is located within a business development area.   (10 pts.)"]
[null,null,null,null,null,null,null,null,null,null,null,null,null,null,null,null,null,null,null,null,null,null,null,null,null,null,null,null,null,null,null,null,null,null,null,null,{"$f":"IF(AJ35>15,15,AJ35)","v":0},null,{"$f":"AJ24+AJ27+AJ30+AJ35+AJ33","v":0}]
[null,null,"DEVELOPMENT CHARACTERISTICS",null,null,null,null,null,null,null,null,null,null,null,null,null,null,null,null,null,null,null,null,null,null,null,null,null,null,null,null,52,{"$f":"AG38+AG43+AG51+AG59","v":0}]
[]
[null,null,5,null," BUILDING STANDARDS",null,null,null,null,null,null,null,null,null,null,null,null,null,{"$f":"IF(AM39>1,\"ERROR:  CHOOSE ONLY ONE BUILDING STANDARD\",\"\")","v":""},null,null,null,null,null,null,null,null,null,null,null,null,7,{"$f":"IF(E39=TRUE,AJ39,(IF(E40=TRUE,7,(IF(E42=TRUE,7,0)))))","v":0}]
[null,null,null,null,false,null,"Development will be built/rehabbed to meet the National Green Building Standard (Silver Level).",null,null,null,null,null,null,null,null,null,null,null,null,null,null,null,null,null,null,null,null,null,null,null,null,null,null,null,null,{"$f":"IF(E39=TRUE,7,0)","v":0},{"$f":"IF(E39=TRUE,1,0)","v":0},null,{"$f":"SUM(AK39:AK41)","v":0}]
[null,null,null,null,false,null,"Development will be built/rehabbed to meet the standard of the Enterprise Green Communities (EGC).",null,null,null,null,null,null,null,null,null,null,null,null,null,null,null,null,null,null,null,null,null,null,null,null,null,null,null,null,{"$f":"IF(E40=TRUE,7,0)","v":0},{"$f":"IF(E40=TRUE,1,0)","v":0}]
[null,null,null,null,null,null,"Development will be built/rehabbed to meet the FORTIFIED Multifamily Standard (Gold).",null,null,null,null,null,null,null,null,null,null,null,null,null,null,null,null,null,null,null,null,null,null,null,null,null,null,null,null,{"$f":"IF(E42=TRUE,7,0)","v":0},{"$f":"IF(E42=TRUE,1,0)","v":0}]
[null,null,null,null,false]
[null,null,6,null,"DEVELOPMENT AMENITIES ",null,null,null,null,null,null,null,null,null,null,null,null,null,null,null,null,null,null,null,null,null,null,null,null,null,null,10,{"$f":"IF(AR49>10,10,AR49)","v":0}]
[null,null,null,null,"Developments will be awarded points (as stated below) per development amenity up to a maximum of ten (10) points.  Amenities must be appropriate to the proposed tenant population.  Applicants mut adhere to all amenities selected, regardless of whether or not points are awarded.",null,null,null,null,null,null,null,null,null,null,null,null,null,null,null,null,null,null,null,null,null,null,null,null,null,null,null,null,null,null,"Amenities Selected"]
[null,null,null,null,false,null,"Advanced Community Services/Classes (2 pts)",null,null,null,null,null,null,null,null,null,null,false,"Fencing (2 pts)",null,null,null,null,false,"        Basketball, Volleyball, or Tennis Court",null,null,null,null,null,null,null,null,null,null,{"$f":"IF(E45=TRUE,2,0)","v":0},{"$f":"IF(R45=TRUE,2,0)","v":0},null,{"$f":"IF(X45=TRUE,2,0)","v":0},{"$f":"IF(X50=TRUE,2,0)","v":0}]
[null,null,null,null,false,null,"Neighborhood Services (2 pts)",null,null,null,null,null,null,null,null,null,null,false,"Exterior Security (2 pts)",null,null,null,null,false,"        Landscaped area/Gazebo/Sitting Area",null,null,null,null,null,null,null,null,null,null,0,{"$f":"IF(R46=TRUE,2,0)","v":0},null,{"$f":"IF(X46=TRUE,2,0)","v":0},{"$f":"IF(X51=TRUE,2,0)","v":0}]
[null,null,null,null,false,null,"Clubhouse/Community Building (2 pts)",null,null,null,null,null,null,null,null,null,null,false,"Fitness Center (2 pts)",null,null,null,null,false,"        Service Coordinator:",null,null,null,null,null,null,null,null,null,null,0,{"$f":"IF(R47=TRUE,2,0)","v":0},null,{"$f":"IF(Y48=1,6,0)","v":6}]
[null,null,null,null,false,null,"On-site Business Center (2 pts)",null,null,null,null,null,null,null,null,null,null,false,"On-site Laundry Facility (2 pts)",null,null,null,null,null,1,"Full-Time (6 pts)",null,null,null,null,null,null,null,null,null,0,{"$f":"IF(R48=TRUE,2,0)","v":0},null,{"$f":"IF(Y48=2,3,0)","v":0}]
[null,null,null,null,false,null,"Playground (2 pts)",null,null,null,null,null,null,null,null,null,null,false,"Walking/Jogging/Biking Trail (2 pts)",null,null,null,null,null,null,"Part-Time (3 pts)",null,null,null,null,null,null,null,null,null,0,{"$f":"IF(R49=TRUE,2,0)","v":0},null,{"$f":"IF(Y48=2,0,0)","v":0},{"$f":"IF(X47=TRUE,(IF(AM50>0,AM50,0)),0)","v":0},null,null,null,{"$f":"AJ45+AJ46+AJ47+AJ48+AJ49+AK45+AK46+AM45+AM46+AK47+AK48+AK49+AN49+AJ50+AK50+AN45+AN46","v":0}]
[null,null,null,null,false,null,"Development Wi-Fi (2 pts)",null,null,null,null,null,null,null,null,null,null,false,"Experienced Service Provider (6 pts)",null,null,null,null,false,"       Multi-Purpose Bus Stop Structure (2 pts)",null,null,null,null,null,null,null,null,null,null,0,{"$f":"IF(R50=TRUE,6,0)","v":0},null,{"$f":"AM47+AM48+AM49","v":6}]
[null,null,7,null,"UNIT AMENITIES ",null,null,null,null,null,null,null,null,null,null,null,null,null,null,null,null,null,null,false,"       MDOT Ride Share Availability",null,null,null,null,null,null,10,{"$f":"IF(AM57>10,10,AM57)","v":0}]
[null,null,null,null,"Developments will be awarded points based on the type of unit amenities to be offered up to a maximum of ten (10) points. Amenities must be appropriate to the proposed tenant population.  Applicants must adhere to all amenities selected, regardless of whether or not points are awarded."]
[null,null,null,null,"one-point amenities",null,null,null,null,null,null,null,null,null,null,null,"two-point amenities",null,null,null,null,null,null,null,null,null,"three-point amenities"]
[null,null,null,null,false,null,"Patios",null,null,null,null,null,null,null,null,null,false,"Washer/Dryers in each Unit",null,null,null,null,null,null,null,null,false,"Indoor Security System",null,null,null,null,null,null,null,{"$f":"IF(E54=TRUE,1,0)","v":0},{"$f":"IF(Q54=TRUE,2,0)","v":0},{"$f":"IF(AA54=TRUE,3,0)","v":0}]
[null,null,null,null,false,null,"Outside Storage Lockers",null,null,null,null,null,null,null,null,null,false,"Tankless water heaters",null,null,null,null,null,null,null,null,false,"Storm Doors",null,null,null,null,null,null,null,{"$f":"IF(E55=TRUE,1,0)","v":0},{"$f":"IF(Q55=TRUE,2,0)","v":0},{"$f":"IF(AA55=TRUE,3,0)","v":0}]
[null,null,null,null,false,null,"Smart Thermostat",null,null,null,null,null,null,null,null,null,null,null,null,null,null,null,null,null,null,null,false,"Storm Shelter",null,null,null,null,null,null,null,{"$f":"IF(E56=TRUE,1,0)","v":0},null,{"$f":"IF(AA56=TRUE,3,0)","v":0}]
[null,null,null,null,null,null,null,null,null,null,null,null,null,null,null,null,null,null,null,null,null,null,null,null,null,null,false,"Smoke-Free Development",null,null,null,null,null,null,null,{"$f":"IF(E57=TRUE,1,0)","v":0},null,{"$f":"IF(AA57=TRUE,3,0)","v":0},{"$f":"AJ54+AJ55+AJ56+AK54+AK55+AK56+AK57+AL54+AL55+AL56+AL57+AJ57","v":0}]
[]
[null,null,8,null,"DEVELOPMENT TYPE",null,null,null,null,null,null,{"$f":"IF(AJ65>0,(IF(AN61>0,\"ERROR:  SELECT ONLY ONE TYPE.\",\"\")),\"\")","v":""},null,null,null,null,null,null,null,null,null,null,null,null,null,null,null,null,null,null,null,25,{"$f":"AL66","v":0}]
[null,null,null,null,false,null,"New Construction (10 pts.)"]
{"$rows_left_out":59}
{"sheet":"Factors","index":1,"n_rows":322,"n_cols":34,"rows_kept":322,"cut":false,"hidden":true,"merged":[]}
[null,null,null,"Counties",null,"DDA","Over Concentrated Zip Codes"]
[null,"Compliance Period",1,null,null,null,1,null,0,null,null,"ZIP","Pts","PO_NAME","State","ST","Population_2010"]
[null,10,2,"ADAMS",1,"x",2,38801,-5,null,1,null,0,null,null,null,null,null,null,1,null,null,null,null,"Substantial Rehab",null,null,null,"NGBS",null,null,null,"Blight Options"]
[null,11,3,"ALCORN",1,null,null,null,-5,null,{"$f":"K3+1","v":2},38601,5,"Abbeville","Mississippi","MS",2062,null,null,2,"one development",2,null,1,null,0,null,1,null,0,null,1,null,0]
[null,12,4,"AMITE",2,"x",null,null,-5,null,{"$f":"K4+1","v":3},38603,5,"Ashland","Mississippi","MS",12585,null,null,3,"two developments",4,null,2,"Rehab Costs between $15,000 and $24,999 per unit (5 pts)",5,null,2,"Bronze Level (0 pts)",0,null,2,"The proposed site has one or more blighted substantial buildings.",10]
[null,13,5,"ATTALA",5,"x",null,null,null,null,4,38610,5,"Blue Mountain","Mississippi","MS",4886,null,null,4,"three developments",6,null,3,"Rehab Costs between $25,000 and $34,999 per unit (10 pts)",10,null,3,"Silver Level (7 pts)",7,null,3,"The proposed site consists of a neighborhood with at least four commercial/residential blighted buildings.",10]
[null,14,6,"BENTON",5,"x",null,null,null,null,5,38611,5,"Byhalia","Mississippi","MS",525,null,null,5,"four developments",8,null,4,"Rehab Costs of >/= $35,000 per unit (15 pts)",15,null,4,"Gold Level (10 pts)",10,null,4,"The proposed development consists of scattered sites with blighted structures on four or more individual parcels.",10]
[null,15,7,"BOLIVAR",3,"x",null,null,null,null,6,38617,5,"Coahoma","Mississippi","MS",12295,null,null,6,"five or more developments",10,null,null,null,null,null,null,null,null,null,5,"The proposed development blighted structures to be removed under MHC's Blight Elimination Program.",10]
[null,16,8,"CALHOUN",3,"x",null,null,null,null,7,38618,5,"Coldwater","Mississippi","MS",2263]
[null,17,9,"CARROLL",1,"x",null,null,null,null,8,38619,5,"Como","Mississippi","MS",3771]
[null,18,10,"CHICKASAW",2,"x",null,null,null,null,9,38620,5,"Courtland","Mississippi","MS",1387]
[null,19,11,"CHOCTAW",3,"x",null,null,null,null,10,38625,5,"Dumas","Mississippi","MS",8137]
[null,20,12,"CLAIBORNE",5,"x",null,null,null,null,11,38626,5,"Dundee","Mississippi","MS",639]
[null,21,13,"CLARKE",3,"x",null,null,null,null,12,38627,5,"Etta","Mississippi","MS",3868]
[null,22,14,"CLAY",4,"x",null,null,null,null,13,38629,5,"Falkner","Mississippi","MS",15513]
[null,23,15,"COAHOMA",3,"x",null,null,null,null,14,38632,5,"Hernando","Mississippi","MS",5887]
[null,24,16,"COPIAH",4,null,null,null,null,null,15,38633,5,"Hickory Flat","Mississippi","MS",2710]
[null,25,17,"COVINGTON",1,"x",null,null,null,null,16,38637,5,"Horn Lake","Mississippi","MS",5130]
[null,26,18,"DE SOTO",4,null,null,null,null,null,17,38641,5,"Lake Cormorant","Mississippi","MS",2515]
[null,27,19,"FORREST",1,null,null,null,null,null,18,38642,5,"Lamar","Mississippi","MS",6826]
[null,28,20,"FRANKLIN",3,"x",null,null,null,null,19,38643,5,"Lambert","Mississippi","MS",1243]
[null,29,21,"GEORGE",4,null,null,null,null,null,20,38645,5,"Lyon","Mississippi","MS",2268]
[null,30,22,"GREENE",5,"x",null,null,null,null,21,38646,5,"Marks","Mississippi","MS",3450]
[null,"Other",23,"GRENADA",2,"x",null,null,null,null,22,38647,5,"Michigan City","Mississippi","MS",145]
[null,null,24,"HANCOCK",1,"x",null,null,null,null,23,38650,5,"Myrtle","Mississippi","MS",426]
[null,null,25,"HARRISON",5,"x",null,null,null,null,24,38651,5,"Nesbit","Mississippi","MS",18385]
[null,null,26,"HINDS",1,null,null,null,null,null,25,38652,5,"New Albany","Mississippi","MS",2811]
[null,null,27,"HOLMES",5,"x",null,null,null,null,26,38654,5,"Olive Branch","Mississippi","MS",3610]
[null,null,28,"HUMPHREYS",3,"x",null,null,null,null,27,38655,5,"Oxford","Mississippi","MS",3749]
[null,null,29,"ISSAQUENA",1,"x",null,null,null,null,28,38658,5,"Pope","Mississippi","MS",6227]
[null,null,30,"ITAWAMBA",1,null,null,null,null,null,29,38659,5,"Potts Camp","Mississippi","MS",3469]
[null,null,31,"JACKSON",5,null,null,null,null,null,30,38661,5,"Red Banks","Mississippi","MS",18148]
[null,null,32,"JASPER",2,"x",null,null,null,null,31,38663,5,"Ripley","Mississippi","MS",1845]
[null,null,33,"JEFFERSON",3,"x",null,null,null,null,32,38664,5,"Robinsonville","Mississippi","MS",34126]
[null,null,34,"JEFFERSON DAVIS",4,"x",null,null,null,null,33,38665,5,"Sarah","Mississippi","MS",35697]
[null,null,35,"JONES",5,"x",null,null,null,null,34,38668,5,"Senatobia","Mississippi","MS",3392]
[null,null,36,"KEMPER",4,"x",null,null,null,null,35,38670,5,"Sledge","Mississippi","MS",23593]
[null,null,37,"LAFAYETTE",2,null,null,null,null,null,36,38671,5,"Southaven","Mississippi","MS",1737]
[null,null,38,"LAMAR",2,null,null,null,null,null,37,38672,5,"Southaven","Mississippi","MS",4221]
[null,null,39,"LAUDERDALE",1,"x",null,null,null,null,38,38673,5,"Taylor","Mississippi","MS",3849]
[null,null,40,"LAWRENCE",2,null,null,null,null,null,39,38674,5,"Tiplersville","Mississippi","MS",1964]
[null,null,41,"LEAKE",5,"x",null,null,null,null,40,38676,5,"Tunica","Mississippi","MS",1100]
[null,null,42,"LEE",1,null,null,null,null,null,41,38677,5,"University","Mississippi","MS",2642]
[null,null,43,"LEFLORE",4,"x",null,null,null,null,42,38680,5,"Walls","Mississippi","MS",17064]
[null,null,44,"LINCOLN",3,"x",null,null,null,null,43,38683,5,"Walnut","Mississippi","MS",11636]
[null,null,45,"LOWNDES",2,null,null,null,null,null,44,38685,5,"Waterford","Mississippi","MS",5383]
[null,null,46,"MADISON",1,null,null,null,null,null,45,38701,5,"Greenville","Mississippi","MS",4870]
[null,null,47,"MARION",3,"x",null,null,null,null,46,38703,5,"Greenville","Mississippi","MS",1318]
[null,null,48,"MARSHALL",4,null,null,null,null,null,47,38720,5,"Alligator","Mississippi","MS",16730]
[null,null,49,"MONROE",4,"x",null,null,null,null,48,38721,5,"Anguilla","Mississippi","MS",3393]
[null,null,50,"MONTGOMERY",3,"x",null,null,null,null,49,38725,5,"Benoit","Mississippi","MS",1430]
[null,null,51,"NESHOBA",1,"x",null,null,null,null,50,38726,5,"Beulah","Mississippi","MS",549]
[null,null,52,"NEWTON",1,"x",null,null,null,null,51,38730,5,"Boyle","Mississippi","MS",2030]
[null,null,53,"NOXUBEE",4,"x",null,null,null,null,52,38731,5,"Chatham","Mississippi","MS",1012]
[null,null,54,"OKTIBBEHA",4,"x",null,null,null,null,53,38733,5,"Cleveland","Mississippi","MS",3709]
[null,null,55,"PANOLA",2,"x",null,null,null,null,54,38736,5,"Doddsville","Mississippi","MS",5935]
[null,null,56,"PEARL RIVER",2,"x",null,null,null,null,55,38740,5,"Duncan","Mississippi","MS",148]
[null,null,57,"PERRY",4,null,null,null,null,null,56,38744,5,"Glen Allan","Mississippi","MS",1203]
[null,null,58,"PIKE",4,"x",null,null,null,null,57,38746,5,"Gunnison","Mississippi","MS",140]
[null,null,59,"PONTOTOC",2,null,null,null,null,null,58,38748,5,"Hollandale","Mississippi","MS",26022]
{"$rows_left_out":263}
{"sheet":"Zip Codes","index":2,"n_rows":513,"n_cols":6,"rows_kept":513,"cut":false,"hidden":true,"merged":[]}
[]
[]
[]
[]
[null,"ZIP Code","Common Cities","Post Office Name","Qualified?","LIHTC Units 2017-2022"]
[1,38601,null,"Abbeville","Yes","No"]
[{"$f":"A6+1","v":2},38603,null,"Ashland","Yes","No"]
[{"$f":"A7+1","v":3},38606,null,"Batesville","Yes","No"]
[4,38610,null,"Blue Mountain","Yes","No"]
[5,38611,null,"Byhalia","Yes","No"]
[6,38614,null,"Clarksdale","Yes","No"]
[7,38617,null,"Coahoma","Yes","No"]
[8,38618,null,"Coldwater","Yes","No"]
[9,38619,null,"Como","Yes","No"]
[10,38620,null,"Courtland","Yes","No"]
[11,38621,null,"Crenshaw","Yes","No"]
[12,38625,null,"Dumas","Yes","No"]
[13,38626,null,"Dundee","Yes","No"]
[14,38627,null,"Etta","Yes","No"]
[15,38629,null,"Falkner","Yes","No"]
[16,38631,null,"Friars Point","Yes","No"]
[17,38632,null,"Hernando","Yes","No"]
[18,38633,null,"Hickory Flat","Yes","No"]
[19,38635,null,"Holly Springs","Yes","No"]
[20,38637,null,"Horn Lake","Yes","No"]
[21,38639,null,"Jonestown","Yes"]
[22,38641,null,"Lake Cormorant","Yes","No"]
[23,38642,null,"Lamar","Yes","No"]
[24,38643,null,"Lambert","Yes","No"]
[25,38645,null,"Lyon","Yes","No"]
[26,38646,null,"Marks","Yes","No"]
[27,38647,null,"Michigan City","Yes","No"]
[28,38650,null,"Myrtle","Yes","No"]
[29,38651,null,"Nesbit","Yes","No"]
[30,38652,null,"New Albany","Yes","No"]
[31,38654,null,"Olive Branch","Yes","No"]
[32,38655,null,"Oxford","Yes"]
[33,38658,null,"Pope","Yes","No"]
[34,38659,null,"Potts Camp","Yes","No"]
[35,38661,null,"Red Banks","Yes","No"]
[36,38663,null,"Ripley","Yes","No"]
[37,38664,null,"Robinsonville","Yes","No"]
[38,38665,null,"Sarah","No","No"]
[39,38666,null,"Sardis","Yes","No"]
[40,38668,null,"Senatobia","Yes","No"]
[41,38670,null,"Sledge","Yes","No"]
[42,38671,null,"Southaven","Yes","No"]
[43,38672,null,"Southaven","Yes","No"]
[44,38673,null,"Taylor","Yes","No"]
[45,38674,null,"Tiplersville","Yes","No"]
[46,38676,null,"Tunica","Yes","No"]
[47,38677,null,"University","Yes","No"]
[48,38680,null,"Walls","No","No"]
[49,38683,null,"Walnut","Yes","No"]
[50,38685,null,"Waterford","Yes","No"]
[51,38701,null,"Greenville","Yes","No"]
[52,38703,null,"Greenville","Yes","No"]
[53,38720,null,"Alligator","Yes","No"]
[54,38721,null,"Anguilla","Yes","No"]
[55,38725,null,"Benoit","Yes","No"]
{"$rows_left_out":454}
{"sheet":"Sheet1","index":3,"n_rows":509,"n_cols":5,"rows_kept":509,"cut":false,"hidden":true,"merged":[]}
[]
[]
[38601,"Abbeville","Lafayette County",{"$f":"IF(E3=\"No\",\"Yes\",\"No\")","v":"Yes"},"No"]
[38602,"Arkabutla","Tate County",{"$f":"IF(E4=\"No\",\"Yes\",\"No\")","v":"Yes"},"No"]
[38603,"Ashland, Canaan","Benton County",{"$f":"IF(E5=\"No\",\"Yes\",\"No\")","v":"Yes"},"No"]
[38606,"Batesville","Panola County","Yes","Yes"]
[38609,"Belen","Quitman County",{"$f":"IF(E7=\"No\",\"Yes\",\"No\")","v":"No"},"Yes"]
[38610,"Blue Mountain","Tippah County","Yes","No"]
[38611,"Byhalia","Marshall County","Yes","No"]
[38614,"Clarksdale, Mattson, Stovall","Coahoma County","Yes","No"]
[38617,"Coahoma, Rich","Coahoma County","Yes","No"]
[38618,"Coldwater","Tate County","Yes","No"]
[38619,"Como","Panola County","Yes","No"]
[38620,"Courtland","Panola County","Yes","No"]
[38621,"Crenshaw, Askew","Panola County","Yes","Yes"]
[38622,"Crowder","Quitman County",{"$f":"IF(E16=\"No\",\"Yes\",\"No\")","v":"Yes"},"No"]
[38623,"Darling","Quitman County","Yes","No"]
[38625,"Dumas","Tippah County","Yes","No"]
[38626,"Dundee","Tunica County","Yes","No"]
[38627,"Etta","Union County","Yes","No"]
[38629,"Falkner","Tippah County","Yes","No"]
[38631,"Friars Point","Coahoma County","Yes","Yes"]
[38632,"Hernando","DeSoto County",{"$f":"IF(E23=\"No\",\"Yes\",\"No\")","v":"Yes"},"No"]
[38633,"Hickory Flat","Benton County","Yes","No"]
[38635,"Holly Springs, Mount Pleasant, Mt Pleasant","Marshall County","No","Yes"]
[38637,"Horn Lake","DeSoto County","Yes","No"]
[38638,"Independence","Tate County","Yes","No"]
[38639,"Jonestown","Coahoma County","Yes","No"]
[38641,"Lake Cormorant, Lk Cormorant","DeSoto County","Yes","No"]
[38642,"Lamar","Benton County","Yes","No"]
[38643,"Lambert","Quitman County","Yes","No"]
[38644,"Lula","Coahoma County","Yes","No"]
[38645,"Lyon","Coahoma County","Yes","No"]
[38646,"Marks","Quitman County","Yes","No"]
[38647,"Michigan City","Benton County","Yes","No"]
[38649,"Mount Pleasant, Holly Springs, Mt Pleasant","Marshall County","Yes","No"]
[38650,"Myrtle","Union County","Yes","No"]
[38651,"Nesbit","DeSoto County","Yes","No"]
[38652,"New Albany","Union County","No","Yes"]
[38654,"Olive Branch, Mineral Wells","DeSoto County","Yes","No"]
[38655,"Oxford, Lafayette","Lafayette County","Yes","No"]
[38658,"Pope","Panola County","Yes","No"]
[38659,"Potts Camp","Marshall County","Yes","No"]
[38661,"Red Banks","Marshall County","Yes","No"]
[38663,"Ripley","Tippah County","Yes","No"]
[38664,"Robinsonville, Tunica Resort, Tunica Resorts","Tunica County","Yes","No"]
[38665,"Sarah, Savage","Tate County","Yes","No"]
[38666,"Sardis","Panola County","Yes","Yes"]
[38668,"Senatobia","Tate County",{"$f":"IF(E49=\"No\",\"Yes\",\"No\")","v":"Yes"},"No"]
[38670,"Sledge, Falcon","Quitman County","Yes","No"]
[38671,"Southaven","DeSoto County","Yes","No"]
[38672,"Southaven","DeSoto County","Yes","No"]
[38673,"Taylor","Lafayette County","Yes","No"]
[38674,"Tiplersville","Tippah County","Yes","No"]
[38676,"Tunica","Tunica County","Yes","No"]
[38677,"University","Lafayette County","Yes","No"]
[38679,"Victoria","Marshall County","Yes","No"]
[38680,"Walls","DeSoto County","Yes","No"]
[38683,"Walnut","Tippah County","Yes","No"]
[38685,"Waterford","Marshall County","Yes","No"]
{"$rows_left_out":449}